Jump to content
Search In
  • More options...
Find results that contain...
Find results in...

pmc2

Members+
  • Content Count

    12
  • Joined

  • Last visited

Community Reputation

0 Neutral

About pmc2

  • Rank
    Beginner
  1. that's what i did previously. In addition, each error is blocking, impossible to go further ^^
  2. ok for dll libgcc... but rest: the procedure entry point __gxx_personality_v0 could not be located in the dynamic link library libstdc++-6.dll 🤔
  3. Only for info (i've test on all system), 0.91.6 break the compatibility with xp: miss LIBGCC_S_DW2-1.DLL the procedure entry point __gxx_personality_v0 could not be located in the dynamic link library libstdc++-6.dll etc I guess we don't care even if it was one of the interests of 32 bit binaries. I had to signal you ;)
  4. Hi, the 32-bit version is stamped 0.90.1 and not 0.90.2. Another thing: what is the difference between this (new 64 bits) version and 0.90.2 available on 11/20/2019 (crc32: 89d34ad6) , the version number being the same ??? thanks ps: miss unibios v4.0, 3.3,.3.2 and unibioscd 3.3 in the bios list^^
  5. pmc2

    MAMEUI 0.218

    st hiryu, thx
  6. pmc2

    HBMAME 0.209

    hi Robbbert, mame xp also works using gcc 6.3 (see 7), only the 8 seems to exclude it. So I do not know if keeping the 5.3 still has interest? best regards
  7. pmc2

    MAMEUI 0.206 released

    thanks Until March, you can add this.
  8. ok, thanks edit: it's ok with gcc 6.3 without pacman -Suy (And faster compilation. incomprehensible oO).
  9. latest: https://github.com/mamedev/build/releases + pacman -Suy => gcc 7.1 Maybe a recent update :/ ?
  10. hi and thanks Robert ! for info: I wanted to compile a simple mamearcade. There are errors. Do you have an idea? Compiling src/devices/cpu/s2650/s2650.cpp... Compiling src/devices/cpu/saturn/saturn.cpp... Compiling src/devices/cpu/sc61860/sc61860.cpp... In file included from ../../../../../src/devices/cpu/saturn/saturn.cpp:79:0: ../../../../../src/devices/cpu/saturn/satops.hxx: In member function 'void satur n_device::saturn_exchange(int, int, int, int)': ../../../../../src/devices/cpu/saturn/satops.hxx:806:6: error: assuming signed o verflow does not occur when assuming that (X + c) < X is always false [-Werror=s trict-overflow] void saturn_device::saturn_exchange(int left, int begin, int count, int right) ^~~~~~~~~~~~~ ../../../../../src/devices/cpu/saturn/satops.hxx:806:6: error: assuming signed o verflow does not occur when assuming that (X + c) < X is always false [-Werror=s trict-overflow] ../../../../../src/devices/cpu/saturn/satops.hxx: In member function 'void satur n_device::saturn_copy(int, int, int, int)': ../../../../../src/devices/cpu/saturn/satops.hxx:824:6: error: assuming signed o verflow does not occur when assuming that (X + c) < X is always false [-Werror=s trict-overflow] void saturn_device::saturn_copy(int dest, int begin, int count, int src) ^~~~~~~~~~~~~ ../../../../../src/devices/cpu/saturn/satops.hxx:824:6: error: assuming signed o verflow does not occur when assuming that (X + c) < X is always false [-Werror=s trict-overflow] ../../../../../src/devices/cpu/saturn/satops.hxx: In member function 'void satur n_device::saturn_or(int, int, int, int)': ../../../../../src/devices/cpu/saturn/satops.hxx:1040:6: error: assuming signed overflow does not occur when assuming that (X + c) < X is always false [-Werror= strict-overflow] void saturn_device::saturn_or(int dest, int begin, int count, int src) ^~~~~~~~~~~~~ ../../../../../src/devices/cpu/saturn/satops.hxx:1040:6: error: assuming signed overflow does not occur when assuming that (X + c) < X is always false [-Werror= strict-overflow] ../../../../../src/devices/cpu/saturn/satops.hxx: In member function 'void satur n_device::saturn_and(int, int, int, int)': ../../../../../src/devices/cpu/saturn/satops.hxx:1055:6: error: assuming signed overflow does not occur when assuming that (X + c) < X is always false [-Werror= strict-overflow] void saturn_device::saturn_and(int dest, int begin, int count, int src) ^~~~~~~~~~~~~ ../../../../../src/devices/cpu/saturn/satops.hxx:1055:6: error: assuming signed overflow does not occur when assuming that (X + c) < X is always false [-Werror= strict-overflow] Compiling src/devices/cpu/scmp/scmp.cpp... Compiling src/devices/cpu/score/score.cpp... cc1plus.exe: all warnings being treated as errors make[2]: *** [optional.make:7000: ../../../../mingw-gcc/obj/x32/Release/src/devi ces/cpu/saturn/saturn.o] Error 1 make[2]: *** Attente des tâches non terminées.... make[1]: *** [Makefile:88: optional] Error 2 make: *** [makefile:1015: windows_x86] Error 2
  11. pmc2

    ARCADE 0.177

    Great thanks. first news: http://www.emu-france.com/news/46034-arcade-arcade32-64-v0-177/
×
×
  • Create New...